BDBM40369 1-(2,3-dihydroindol-1-yl)-2-(4-pyrrol-1-ylphenyl)ethanone::1-(2,3-dihydroindol-1-yl)-2-[4-(1-pyrrolyl)phenyl]ethanone::1-indolin-1-yl-2-(4-pyrrol-1-ylphenyl)ethanone::1-{[4-(1H-pyrrol-1-yl)phenyl]acetyl}indoline::MLS000047180::SMR000033191::cid_3243138
SMILES O=C(Cc1ccc(cc1)-n1cccc1)N1CCc2ccccc12
InChI Key InChIKey=RWAMCYOMQJYQTP-UHFFFAOYSA-N
Data  1 IC50
  Tab Delimited (TSV)   2D SDfile   Computed 3D by Vconf -m prep SDfile
Find this compound or compounds like it in BindingDB:
Activity Spreadsheet -- Enzyme Inhibition Constant Data from BindingDB
Found 1 hit for monomerid = 40369
TargetCoagulation factor XII(Homo sapiens (Human))
Pcmd
Curated by PubChem BioAssay
LigandPNGBDBM40369(1-(2,3-dihydroindol-1-yl)-2-(4-pyrrol-1-ylphenyl)e...)
Affinity DataIC50: >5.00E+4nM. Assay description: Molecular Library Screening Center Network (MLSCN) Penn Center for Molecular Discovery (PCMD) Assay Provider: Scott L. Diamond, University of Pennsy...
In DepthDetails PCBioAssay