BDBM4043 2-thioxo-1H-indole-3-carboxamide deriv. 9g::5-chloro-1-methyl-N-phenyl-2-sulfanylidene-2,3-dihydro-1H-indole-3-carboxamide
SMILES CN1C(=S)C(C(=O)Nc2ccccc2)c2cc(Cl)ccc12
InChI Key InChIKey=LKNJAWRXHXSFKQ-UHFFFAOYSA-N
Data  2 IC50
  Tab Delimited (TSV)   2D SDfile   Computed 3D by Vconf -m prep SDfile
Find this compound or compounds like it in BindingDB:
Activity Spreadsheet -- Enzyme Inhibition Constant Data from BindingDB
Found 2 hits for monomerid = 4043
TargetTyrosine-protein kinase transforming protein Src(Avian sarcoma virus)
University Of Auckland
LigandPNGBDBM4043(2-thioxo-1H-indole-3-carboxamide deriv. 9g | 5-chl...)
Affinity DataIC50: >1.00E+5nM. Assay description: IC50 is the inhibitor concentration which inhibits 50% of kinase activity that catalyzes the transfer of the terminal phosphate from [gamma-32P] labe...
In DepthDetails ArticlePubMed
TargetEpidermal growth factor receptor(Homo sapiens (Human))
University Of Auckland
LigandPNGBDBM4043(2-thioxo-1H-indole-3-carboxamide deriv. 9g | 5-chl...)
Affinity DataIC50: >1.00E+5nM. Assay description: IC50 is the inhibitor concentration which inhibits 50% of kinase activity that catalyzes the transfer of the terminal phosphate from [gamma-32P] labe...
In DepthDetails ArticlePubMed