BDBM40460 6-[(4-methoxyphenoxy)methyl]-3-(3-methoxyphenyl)-[1,2,4]triazolo[3,4-b][1,3,4]thiadiazole::MLS000041200::SMR000046783::cid_665708
SMILES COc1ccc(OCc2nn3c(nnc3s2)-c2cccc(OC)c2)cc1
InChI Key InChIKey=UFZZSTGFLPULTF-UHFFFAOYSA-N
Data  1 IC50
  Tab Delimited (TSV)   2D SDfile   Computed 3D by Vconf -m prep SDfile
Find this compound or compounds like it in BindingDB:
Activity Spreadsheet -- Enzyme Inhibition Constant Data from BindingDB
Found 1 hit for monomerid = 40460
TargetCollagenase 3(Homo sapiens (Human))
The Scripps Research Institute Molecular Screening Center
Curated by PubChem BioAssay
LigandPNGBDBM40460(6-[(4-methoxyphenoxy)methyl]-3-(3-methoxyphenyl)-[...)
Affinity DataIC50:  2.29E+3nM. Assay description: Source (MLSCN Center Name): The Scripps Research Institute Molecular Screening Center Center Affiliation: The Scripps Research Institute, TSRI Assay ...
In DepthDetails PCBioAssay