BDBM4047 1-methyl-N-phenyl-2-(phenyldisulfanyl)-1H-indole-3-carboxamide::2-thioxo-1H-indole-3-carboxamide deriv. 13::l-Methyl-N-phenyl-2-(phenyldithio)-1H-indole-3-carboxamide
SMILES Cn1c(SSc2ccccc2)c(C(=O)Nc2ccccc2)c2ccccc12
InChI Key InChIKey=ULDPDJYUQOVMMM-UHFFFAOYSA-N
Data  2 IC50
  Tab Delimited (TSV)   2D SDfile   Computed 3D by Vconf -m prep SDfile
Find this compound or compounds like it in BindingDB:
Activity Spreadsheet -- Enzyme Inhibition Constant Data from BindingDB
Found 2 hits for monomerid = 4047
TargetTyrosine-protein kinase transforming protein Src(Avian sarcoma virus)
University Of Auckland
LigandPNGBDBM4047(1-methyl-N-phenyl-2-(phenyldisulfanyl)-1H-indole-3...)
Affinity DataIC50: >1.00E+5nM. Assay description: IC50 is the inhibitor concentration which inhibits 50% of kinase activity that catalyzes the transfer of the terminal phosphate from [gamma-32P] labe...
In DepthDetails ArticlePubMed
TargetEpidermal growth factor receptor(Homo sapiens (Human))
University Of Auckland
LigandPNGBDBM4047(1-methyl-N-phenyl-2-(phenyldisulfanyl)-1H-indole-3...)
Affinity DataIC50: >1.00E+5nM. Assay description: IC50 is the inhibitor concentration which inhibits 50% of kinase activity that catalyzes the transfer of the terminal phosphate from [gamma-32P] labe...
In DepthDetails ArticlePubMed