BDBM40630 MLS000087341::N-(2-methylsulfanylphenyl)-5,6-dihydro-4H-cyclopenta[d][1,2]oxazole-3-carboxamide::N-[2-(methylthio)phenyl]-5,6-dihydro-4H-cyclopent[d]isoxazole-3-carboxamide::N-[2-(methylthio)phenyl]-5,6-dihydro-4H-cyclopenta[d]isoxazole-3-carboxamide::SMR000023564::cid_3238925
SMILES CSc1ccccc1NC(=O)c1noc2CCCc12
InChI Key InChIKey=PFTVWYPBAGVJLZ-UHFFFAOYSA-N
Data  3 IC50
  Tab Delimited (TSV)   2D SDfile   Computed 3D by Vconf -m prep SDfile
Find this compound or compounds like it in BindingDB:
Activity Spreadsheet -- Enzyme Inhibition Constant Data from BindingDB
Found 3 hits for monomerid = 40630
TargetNuclear receptor subfamily 4 group A member 1(Homo sapiens (Human))
Burnham Center For Chemical Genomics
Curated by PubChem BioAssay
LigandPNGBDBM40630(MLS000087341 | N-(2-methylsulfanylphenyl)-5,6-dihy...)
Affinity DataIC50:  1.26E+4nM. Assay description: Sanford-Burnham Center for Chemical Genomics (SBCCG) Sanford-Burnham Medical Research Institute (San Diego, CA) NIH Molecular Libraries Screening Cen...
In DepthDetails PCBioAssay
TargetEstrogen receptor beta(Homo sapiens (Human))
Emory University
Curated by PubChem BioAssay
LigandPNGBDBM40630(MLS000087341 | N-(2-methylsulfanylphenyl)-5,6-dihy...)
Affinity DataIC50:  3.77E+3nM. Assay description: NIH Molecular Libraries Screening Centers Network [MLSCN] Emory Chemical Biology Discovery Center in MLSCN Assay provider: John A. Katzenellenbogen, ...
In DepthDetails PCBioAssay
TargetEstrogen receptor beta(Homo sapiens (Human))
Emory University
Curated by PubChem BioAssay
LigandPNGBDBM40630(MLS000087341 | N-(2-methylsulfanylphenyl)-5,6-dihy...)
Affinity DataIC50:  5.00E+4nM. Assay description: NIH Molecular Libraries Screening Centers Network [MLSCN] Emory Chemical Biology Discovery Center in MLSCN Assay provider: John A. Katzenellenbogen, ...
In DepthDetails PCBioAssay