BDBM40781 Calyculin J (14)
SMILES CC[C@H](O)CC1(OCC\C=C\c2coc(n2)C(C)CCNC(=O)[C@@H](O)C(O)[C@H](COC)N(C)C)O[C@H]([C@H](C[C@H](O)C(C)C2OC(C)([C@H](Br)[C@H]2C)C(\C)=C\C=C\C(\C)=C\C#N)OC)[C@H](OP(O)(O)=O)C1(C)C
InChI Key InChIKey=MTGXNHUJVSHDRT-BWMKULBOSA-N
Data  2 IC50
  Tab Delimited (TSV)   2D SDfile   Computed 3D by Vconf -m prep SDfile
Find this compound or compounds like it in BindingDB:
Activity Spreadsheet -- Enzyme Inhibition Constant Data from BindingDB
Found 2 hits for monomerid = 40781
TargetSerine/threonine-protein phosphatase 2A activator(Homo sapiens (Human))
The University Of Tokyo
LigandPNGBDBM40781(Calyculin J (14))
Affinity DataIC50:  20nM. Assay description: Protein phosphatase inhibitory activity of calyculin derivatives.
In DepthDetails ArticlePubMed
TargetProtein phosphatase 1 regulatory subunit 1A(Homo sapiens (Human))
The University Of Tokyo
LigandPNGBDBM40781(Calyculin J (14))
Affinity DataIC50:  105nM. Assay description: Protein phosphatase inhibitory activity of calyculin derivatives.
In DepthDetails ArticlePubMed