BDBM40885 MLS000049608::N-(1,1-diketothiolan-3-yl)-3-piperidinosulfonyl-benzamide::N-(1,1-dioxidotetrahydro-3-thienyl)-3-(1-piperidinylsulfonyl)benzamide::N-(1,1-dioxo-3-thiolanyl)-3-(1-piperidinylsulfonyl)benzamide::N-(1,1-dioxothiolan-3-yl)-3-piperidin-1-ylsulfonylbenzamide::N-[1,1-bis(oxidanylidene)thiolan-3-yl]-3-piperidin-1-ylsulfonyl-benzamide::SMR000076170::cid_2952920
SMILES O=C(NC1CCS(=O)(=O)C1)c1cccc(c1)S(=O)(=O)N1CCCCC1
InChI Key InChIKey=VSWDJQDTXNUZAG-UHFFFAOYSA-N
Data  1 IC50
  Tab Delimited (TSV)   2D SDfile   Computed 3D by Vconf -m prep SDfile
Find this compound or compounds like it in BindingDB:
Activity Spreadsheet -- Enzyme Inhibition Constant Data from BindingDB
Found 1 hit for monomerid = 40885
TargetComplement C1s subcomponent(Homo sapiens (Human))
Pcmd
Curated by PubChem BioAssay
LigandPNGBDBM40885(MLS000049608 | N-(1,1-diketothiolan-3-yl)-3-piperi...)
Affinity DataIC50: >5.00E+4nM. Assay description: Molecular Library Screening Center Network (MLSCN) Penn Center for Molecular Discovery (PCMD) Assay Provider: Dr. Scott L. Diamond, University of Pen...
In DepthDetails PCBioAssay