BDBM408980 Thyroxine::US10377729, T4
SMILES [NH3+][C@@H](Cc1cc(I)c(Oc2cc(I)c(O)c(I)c2)c(I)c1)C([O-])=O
InChI Key InChIKey=XUIIKFGFIJCVMT-LBPRGKRZSA-N
Data  1 IC50
  Tab Delimited (TSV)   2D SDfile   Computed 3D by Vconf -m prep SDfile
Find this compound or compounds like it in BindingDB:
Activity Spreadsheet -- Enzyme Inhibition Constant Data from BindingDB
Found 1 hit for monomerid = 408980
TargetTransthyretin(Homo sapiens (Human))
Bsim Therapeutics
US Patent
LigandPNGBDBM408980(Thyroxine | US10377729, T4)
Affinity DataIC50:  2.20E+3nM. Assay description: In vitro evaluation of inhibitory activity against WT-TTR amyloid fibril formation of AT09 and reference compounds. Reference compounds (thyroxine, t...
In DepthDetails US Patent