BDBM41353 MLS000065709::N-(5-methyl-1,3,4-thiadiazol-2-yl)-5-propyl-3-thiophenecarboxamide::N-(5-methyl-1,3,4-thiadiazol-2-yl)-5-propyl-thiophene-3-carboxamide::N-(5-methyl-1,3,4-thiadiazol-2-yl)-5-propylthiophene-3-carboxamide::SMR000080372::cid_1245519
SMILES CCCc1cc(cs1)C(=O)Nc1nnc(C)s1
InChI Key InChIKey=NWUGJNCKGDORAT-UHFFFAOYSA-N
Data  1 IC50
  Tab Delimited (TSV)   2D SDfile   Computed 3D by Vconf -m prep SDfile
Find this compound or compounds like it in BindingDB:
Activity Spreadsheet -- Enzyme Inhibition Constant Data from BindingDB
Found 1 hit for monomerid = 41353
TargetCathepsin S(Homo sapiens (Human))
Pcmd
Curated by PubChem BioAssay
LigandPNGBDBM41353(MLS000065709 | N-(5-methyl-1,3,4-thiadiazol-2-yl)-...)
Affinity DataIC50: >5.00E+4nM. Assay description: Screening Center: Penn Center for Molecular Discovery Center Affiliation: University of Pennsylvania Network: Molecular Library Screening Center Netw...
In DepthDetails PCBioAssay