BDBM41668 1-(3-imidazol-1-ylpropyl)-2-imino-10-methyl-5-oxo-N-(2-phenylethyl)dipyrido[3,4-c:1',2'-f]pyrimidine-3-carboxamide::1-(3-imidazol-1-ylpropyl)-2-imino-5-keto-10-methyl-N-phenethyl-dipyrido[3,4-c:1',2'-f]pyrimidine-3-carboxamide::1-[3-(1-imidazolyl)propyl]-2-imino-10-methyl-5-oxo-N-(2-phenylethyl)-3-dipyrido[3,4-c:1',2'-f]pyrimidinecarboxamide::2-azanylidene-1-(3-imidazol-1-ylpropyl)-10-methyl-5-oxidanylidene-N-(2-phenylethyl)dipyrido[3,4-c:1',2'-f]pyrimidine-3-carboxamide::MLS000519295::SMR000129714::cid_5201463
SMILES Cc1cccn2c1nc1n(CCCn3ccnc3)c(=N)c(cc1c2=O)C(=O)NCCc1ccccc1
InChI Key InChIKey=RDTGAUNECHODQB-UHFFFAOYSA-N
Data  3 IC50  2 EC50
  Tab Delimited (TSV)   2D SDfile   Computed 3D by Vconf -m prep SDfile
Find this compound or compounds like it in BindingDB:
Activity Spreadsheet -- Enzyme Inhibition Constant Data from BindingDB
Found 5 hits for monomerid = 41668
TargetSphingosine 1-phosphate receptor 2(Homo sapiens (Human))
The Scripps Research Institute Molecular Screening Center
Curated by PubChem BioAssay
LigandPNGBDBM41668(1-(3-imidazol-1-ylpropyl)-2-imino-10-methyl-5-oxo-...)
Affinity DataEC50:  4.55E+3nM. Assay description: Source (MLSCN Center Name): The Scripps Research Institute Molecular Screening Center Center Affiliation: The Scripps Research Institute (TSRI) Assay...
In DepthDetails PCBioAssay
TargetSphingosine 1-phosphate receptor 2(Homo sapiens (Human))
The Scripps Research Institute Molecular Screening Center
Curated by PubChem BioAssay
LigandPNGBDBM41668(1-(3-imidazol-1-ylpropyl)-2-imino-10-methyl-5-oxo-...)
Affinity DataEC50:  1.02E+4nM. Assay description: Source (MLSCN Center Name): The Scripps Research Institute Molecular Screening Center Center Affiliation: The Scripps Research Institute (TSRI) Assay...
In DepthDetails PCBioAssay
TargetLow molecular weight phosphotyrosine protein phosphatase(Homo sapiens (Human))
Burnham Center For Chemical Genomics
Curated by PubChem BioAssay
LigandPNGBDBM41668(1-(3-imidazol-1-ylpropyl)-2-imino-10-methyl-5-oxo-...)
Affinity DataIC50: >8.00E+4nM
In DepthDetails PCBioAssay
TargetLow molecular weight phosphotyrosine protein phosphatase(Homo sapiens (Human))
Burnham Center For Chemical Genomics
Curated by PubChem BioAssay
LigandPNGBDBM41668(1-(3-imidazol-1-ylpropyl)-2-imino-10-methyl-5-oxo-...)
Affinity DataIC50:  3.71E+4nM
In DepthDetails PCBioAssay
TargetdTDP-4-dehydrorhamnose 3,5-epimerase(Mycobacterium tuberculosis H37Rv)
Pcmd
Curated by PubChem BioAssay
LigandPNGBDBM41668(1-(3-imidazol-1-ylpropyl)-2-imino-10-methyl-5-oxo-...)
Affinity DataIC50:  7.71E+3nM. Assay description: Molecular Library Screening Center Network (MLSCN) Penn Center for Molecular Discovery (PCMD) Assay Provider: Michael McNeil, Colorado State Universi...
In DepthDetails PCBioAssay