BDBM42186 2-(4-bromanyl-2-chloranyl-phenoxy)-N,N-di(propan-2-yl)ethanamide::2-(4-bromo-2-chloro-phenoxy)-N,N-diisopropyl-acetamide::2-(4-bromo-2-chlorophenoxy)-N,N-di(propan-2-yl)acetamide::MLS000111435::SMR000107359::cid_2230655
SMILES CC(C)N(C(C)C)C(=O)COc1ccc(Br)cc1Cl
InChI Key InChIKey=AVAVUVPAURTGCM-UHFFFAOYSA-N
Data  3 IC50
  Tab Delimited (TSV)   2D SDfile   Computed 3D by Vconf -m prep SDfile
Find this compound or compounds like it in BindingDB:
Activity Spreadsheet -- Enzyme Inhibition Constant Data from BindingDB
Found 3 hits for monomerid = 42186
TargetTyrosine-protein phosphatase YopH(Yersinia enterocolitica)
University Of Pittsburgh
Curated by PubChem BioAssay
LigandPNGBDBM42186(2-(4-bromanyl-2-chloranyl-phenoxy)-N,N-di(propan-2...)
Affinity DataIC50: >5.00E+4nM. Assay description: Yersinia pestis is the causal agent of the bubonic plague and, although modern antibiotics are extremely effective against the malady, the plague rem...
In DepthDetails PCBioAssay
TargetTyrosine-protein phosphatase YopH(Yersinia enterocolitica)
University Of Pittsburgh
Curated by PubChem BioAssay
LigandPNGBDBM42186(2-(4-bromanyl-2-chloranyl-phenoxy)-N,N-di(propan-2...)
Affinity DataIC50: >5.00E+4nM. Assay description: Yersinia pestis is the causal agent of the bubonic plague and, although modern antibiotics are extremely effective against the malady, the plague rem...
In DepthDetails PCBioAssay
TargetTyrosine-protein phosphatase YopH(Yersinia enterocolitica)
University Of Pittsburgh
Curated by PubChem BioAssay
LigandPNGBDBM42186(2-(4-bromanyl-2-chloranyl-phenoxy)-N,N-di(propan-2...)
Affinity DataIC50: >5.00E+4nM. Assay description: Yersinia pestis is the causal agent of the bubonic plague and, although modern antibiotics are extremely effective against the malady, the plague rem...
In DepthDetails PCBioAssay