BDBM42360 MLS000094491::N-[3-(1H-imidazol-1-yl)propyl]-1,9-dimethyl-4-oxo-1,4-dihydropyrido[1,2-a]pyrrolo[2,3-d]pyrimidine-2-carboxamide::SMR000030051::cid_3243418
SMILES Cc1cccn2c1nc1n(C)c(cc1c2=O)C(=O)NCCCn1ccnc1
InChI Key InChIKey=RBIMOCNCXCOONR-UHFFFAOYSA-N
Data  1 EC50
  Tab Delimited (TSV)   2D SDfile   Computed 3D by Vconf -m prep SDfile
Find this compound or compounds like it in BindingDB:
Activity Spreadsheet -- Enzyme Inhibition Constant Data from BindingDB
Found 1 hit for monomerid = 42360
TargetLysosomal acid glucosylceramidase(Homo sapiens (Human))
The Scripps Research Institute Molecular Screening Center
Curated by PubChem BioAssay
LigandPNGBDBM42360(MLS000094491 | N-[3-(1H-imidazol-1-yl)propyl]-1,9-...)
Affinity DataEC50: >1.00E+4nM. Assay description: Source (MLSCN Center Name): The Scripps Research Institute Molecular Screening Center Center Affiliation: The Scripps Research Institute, TSRI Assay ...
In DepthDetails PCBioAssay