BDBM42483 2-[1-[3-(4-methoxyphenyl)-[1,2,4]triazolo[3,4-b][1,3,4]thiadiazol-6-yl]ethyl]isoindole-1,3-dione::2-[1-[3-(4-methoxyphenyl)-[1,2,4]triazolo[3,4-b][1,3,4]thiadiazol-6-yl]ethyl]isoindoline-1,3-quinone::MLS000114360::SMR000091760::cid_4246341
SMILES COc1ccc(cc1)-c1nnc2sc(nn12)C(C)N1C(=O)c2ccccc2C1=O
InChI Key InChIKey=ABAGTJARVQFMJH-UHFFFAOYSA-N
Data  1 IC50
  Tab Delimited (TSV)   2D SDfile   Computed 3D by Vconf -m prep SDfile
Find this compound or compounds like it in BindingDB:
Activity Spreadsheet -- Enzyme Inhibition Constant Data from BindingDB
Found 1 hit for monomerid = 42483
TargetNeuropeptide Y receptor type 1(Homo sapiens (Human))
The Scripps Research Institute Molecular Screening Center
Curated by PubChem BioAssay
LigandPNGBDBM42483(2-[1-[3-(4-methoxyphenyl)-[1,2,4]triazolo[3,4-b][1...)
Affinity DataIC50:  9.35E+3nM. Assay description: Source (MLSCN Center Name): The Scripps Research Institute Molecular Screening Center Affiliation: The Scripps Research Institute, TSRI Assay Provide...
In DepthDetails PCBioAssay