BDBM42732 2-(1-keto-4-methyl-benzothiopheno[2,3-d]pyridazin-2-yl)propionic acid::2-(4-methyl-1-oxidanylidene-[1]benzothiolo[2,3-d]pyridazin-2-yl)propanoic acid::2-(4-methyl-1-oxo-[1]benzothiolo[2,3-d]pyridazin-2-yl)propanoic acid::2-(4-methyl-1-oxo[1]benzothieno[2,3-d]pyridazin-2(1H)-yl)propanoic acid::MLS000095840::SMR000031388::cid_3242118
SMILES CC(C(O)=O)n1nc(C)c2sc3ccccc3c2c1=O
InChI Key InChIKey=OSERJAMIDNURES-UHFFFAOYSA-N
Data  2 IC50
  Tab Delimited (TSV)   2D SDfile   Computed 3D by Vconf -m prep SDfile
Find this compound or compounds like it in BindingDB:
Activity Spreadsheet -- Enzyme Inhibition Constant Data from BindingDB
Found 2 hits for monomerid = 42732
TargetMajor prion protein(Homo sapiens (Human))
The Scripps Research Institute Molecular Screening Center
Curated by PubChem BioAssay
LigandPNGBDBM42732(2-(1-keto-4-methyl-benzothiopheno[2,3-d]pyridazin-...)
Affinity DataIC50:  8.45E+3nM. Assay description: Source (MLPCN Center Name): The Scripps Research Institute Molecular Screening Center (SRIMSC) Affiliation: The Scripps Research Institute, TSRI Assa...
In DepthDetails PCBioAssay
TargetMitogen-activated protein kinase 10(Homo sapiens (Human))
The Scripps Research Institute Molecular Screening Center
Curated by PubChem BioAssay
LigandPNGBDBM42732(2-(1-keto-4-methyl-benzothiopheno[2,3-d]pyridazin-...)
Affinity DataIC50: >9.31E+4nM. Assay description: Source (MLSCN Center Name): The Scripps Research Institute Molecular Screening Center Affiliation: The Scripps Research Institute, TSRI Assay Provide...
In DepthDetails PCBioAssay