BDBM430059 US10538528, Compound 6
SMILES CC(C)NCCNc1ccc(nc1C1CCN(CC1)c1ncnc2NC(=O)C(C)(C)c12)-c1sc(C)nc1C
InChI Key InChIKey=GZBVSECJBWKOFI-UHFFFAOYSA-N
Data  2 IC50
  Tab Delimited (TSV)   2D SDfile   Computed 3D by Vconf -m prep SDfile
Find this compound or compounds like it in BindingDB:
Activity Spreadsheet -- Enzyme Inhibition Constant Data from BindingDB
Found 2 hits for monomerid = 430059
TargetRAC-alpha serine/threonine-protein kinase(Homo sapiens (Human))
Taiho Pahrmaceutical
US Patent
LigandPNGBDBM430059(US10538528, Compound 6)
Affinity DataIC50:  0.400nM. Assay description: S6K1: Inhibitory activity of the compound according to the present invention on S6K1 kinase activity in vitro was assayed using the QSS Assist FP ass...
Ligand InfoPC cidPC sid
In DepthDetails US Patent
TargetRyanodine receptor 1 [4317-4329]()
Taiho Pahrmaceutical
US Patent
LigandPNGBDBM430059(US10538528, Compound 6)
Affinity DataIC50:  1nM. Assay description: Rsk1: Inhibitory activity of the compound according to the present invention on Rsk1 kinase activity in vitro was assayed using the QSS Assist FP ass...
Ligand InfoPC cidPC sid
In DepthDetails US Patent