BDBM4311 (2E)-2-cyano-3-(3,4-dihydroxyphenyl)-N-[2-(3,4-dimethoxyphenyl)ethyl]prop-2-enamide::Tyrphostin deriv. 62
SMILES COc1ccc(CCNC(=O)C(=C\c2ccc(O)c(O)c2)\C#N)cc1OC
InChI Key InChIKey=SPPRJVVDZRWCNP-OQLLNIDSSA-N
Data  1 IC50
  Tab Delimited (TSV)   2D SDfile   Computed 3D by Vconf -m prep SDfile
Find this compound or compounds like it in BindingDB:
Activity Spreadsheet -- Enzyme Inhibition Constant Data from BindingDB
Found 1 hit for monomerid = 4311
TargetEpidermal growth factor receptor(Homo sapiens (Human))
Hebrew University Of Jerusalem
LigandPNGBDBM4311((2E)-2-cyano-3-(3,4-dihydroxyphenyl)-N-[2-(3,4-dim...)
Affinity DataIC50:  1.70E+3nM. Assay description: The activity of EGFR, preactivated with EGF, is measured by its ability to transfer terminal phosphate from [gamma-32P]ATP to poly(GAT) substrate.
In DepthDetails ArticlePubMed