BDBM43447 (5Z)-1-[2-(4-fluorophenyl)ethyl]-5-[(E)-3-phenylprop-2-enylidene]-1,3-diazinane-2,4,6-trione::(5Z)-1-[2-(4-fluorophenyl)ethyl]-5-[(E)-3-phenylprop-2-enylidene]barbituric acid::1-[2-(4-fluorophenyl)ethyl]-5-(3-phenyl-2-propen-1-ylidene)-2,4,6(1H,3H,5H)-pyrimidinetrione::MLS000677107::SMR000270932::cid_1325216
SMILES Fc1ccc(CCN2C(=O)NC(=O)\C(=C\C=C\c3ccccc3)C2=O)cc1
InChI Key InChIKey=ZRCCDSAAMJJQCI-DFBITEFZSA-N
Data  1 EC50
  Tab Delimited (TSV)   2D SDfile   Computed 3D by Vconf -m prep SDfile
Find this compound or compounds like it in BindingDB:
Activity Spreadsheet -- Enzyme Inhibition Constant Data from BindingDB
Found 1 hit for monomerid = 43447
TargetE3 ubiquitin-protein ligase Mdm2(Homo sapiens (Human))
Pcmd
Curated by PubChem BioAssay
LigandPNGBDBM43447((5Z)-1-[2-(4-fluorophenyl)ethyl]-5-[(E)-3-phenylpr...)
Affinity DataEC50:  130nM. Assay description: Molecular Library Screening Center Network (MLSCN) Penn Center for Molecular Discovery (PCMD) Assay Provider: Brent Stockwell, Columbia University ML...
In DepthDetails PCBioAssay