BDBM43728 (E)-N-(5-chloranylpyridin-2-yl)-3-phenyl-prop-2-enamide::(E)-N-(5-chloro-2-pyridinyl)-3-phenyl-2-propenamide::(E)-N-(5-chloro-2-pyridyl)-3-phenyl-acrylamide::(E)-N-(5-chloropyridin-2-yl)-3-phenylprop-2-enamide::MLS000684215::N-(5-chloro-2-pyridinyl)-3-phenylacrylamide::SMR000268017::cid_691131
SMILES Clc1ccc(NC(=O)\C=C\c2ccccc2)nc1
InChI Key InChIKey=VFPYFCBYQRAYFS-RMKNXTFCSA-N
Data  3 EC50
  Tab Delimited (TSV)   2D SDfile   Computed 3D by Vconf -m prep SDfile
Find this compound or compounds like it in BindingDB:
Activity Spreadsheet -- Enzyme Inhibition Constant Data from BindingDB
Found 3 hits for monomerid = 43728
TargetSignal transducer and activator of transcription 3 [702-738,740-752](Homo sapiens (Human))
The Scripps Research Institute Molecular Screening Center
Curated by PubChem BioAssay
LigandPNGBDBM43728((E)-N-(5-chloranylpyridin-2-yl)-3-phenyl-prop-2-en...)
Affinity DataEC50: >5.57E+4nM. Assay description: Source (MLPCN Center Name): The Scripps Research Institute Molecular Screening Center Center Affiliation: The Scripps Research Institute (TSRI) Assay...
In DepthDetails PCBioAssay
TargetG2/mitotic-specific cyclin-B1(Homo sapiens (Human))
The Scripps Research Institute Molecular Screening Center
Curated by PubChem BioAssay
LigandPNGBDBM43728((E)-N-(5-chloranylpyridin-2-yl)-3-phenyl-prop-2-en...)
Affinity DataEC50: >4.98E+4nM. Assay description: Source (MLPCN Center Name): The Scripps Research Institute Molecular Screening Center Center Affiliation: The Scripps Research Institute (TSRI) Assay...
In DepthDetails PCBioAssay
TargetWee1-like protein kinase(Homo sapiens (Human))
The Scripps Research Institute Molecular Screening Center
Curated by PubChem BioAssay
LigandPNGBDBM43728((E)-N-(5-chloranylpyridin-2-yl)-3-phenyl-prop-2-en...)
Affinity DataEC50: >4.98E+4nM. Assay description: Source (MLPCN Center Name): The Scripps Research Institute Molecular Screening Center Center Affiliation: The Scripps Research Institute (TSRI) Assay...
In DepthDetails PCBioAssay