BDBM43823 Kanamycin A, 1::MLS000531200::N-(2,3-dihydro-1,4-benzodioxin-6-yl)-3-(1-piperidinylsulfonyl)benzamide::N-(2,3-dihydro-1,4-benzodioxin-6-yl)-3-piperidin-1-ylsulfonyl-benzamide::N-(2,3-dihydro-1,4-benzodioxin-6-yl)-3-piperidin-1-ylsulfonylbenzamide::N-(2,3-dihydro-1,4-benzodioxin-6-yl)-3-piperidinosulfonyl-benzamide::SMR000136178::cid_1262699
SMILES O=C(Nc1ccc2OCCOc2c1)c1cccc(c1)S(=O)(=O)N1CCCCC1
InChI Key InChIKey=KQXIYYOJORBUBW-UHFFFAOYSA-N
Data  1 IC50  1 Kd
  Tab Delimited (TSV)   2D SDfile   Computed 3D by Vconf -m prep SDfile
Find this compound or compounds like it in BindingDB:
Activity Spreadsheet -- Enzyme Inhibition Constant Data from BindingDB
Found 2 hits for monomerid = 43823
TargetDNA repair protein RAD51 homolog 1(Homo sapiens (Human))
Pcmd
Curated by PubChem BioAssay
LigandPNGBDBM43823(Kanamycin A, 1 | MLS000531200 | N-(2,3-dihydro-1,4...)
Affinity DataIC50:  8.50E+4nM. Assay description: Project Title: A screen for modulators of human Rad51, a key DNA repair protein Application Number: MH084119 Assay Submitter: Dr. Alex Mazin Submitte...
In DepthDetails PCBioAssay
TargetLeucine--tRNA ligase(Thermus thermophilus)
Wayne State University
LigandPNGBDBM43823(Kanamycin A, 1 | MLS000531200 | N-(2,3-dihydro-1,4...)
Affinity DataKd:  1.10E+3nMpH: 7.5 T: 2°C. Assay description: Binding assay of Aminoglycoside antibiotics and kanamycin A derivatives for the bacterial A site RNA.
In DepthDetails ArticlePubMed