BDBM4406 4-Anilidoquinazoline deriv. 22b::N-(2H-1,3-benzodioxol-5-yl)-6-methylquinazolin-4-amine
SMILES Cc1ccc2ncnc(Nc3ccc4OCOc4c3)c2c1
InChI Key InChIKey=CZJCSUFPUYPACT-UHFFFAOYSA-N
Data  1 IC50
  Tab Delimited (TSV)   2D SDfile   Computed 3D by Vconf -m prep SDfile
Find this compound or compounds like it in BindingDB:
Activity Spreadsheet -- Enzyme Inhibition Constant Data from BindingDB
Found 1 hit for monomerid = 4406
TargetEpidermal growth factor receptor(Homo sapiens (Human))
Hebrew University Of Jerusalem
LigandPNGBDBM4406(4-Anilidoquinazoline deriv. 22b | N-(2H-1,3-benzod...)
Affinity DataIC50: >1.00E+5nM. Assay description: The activity of EGFR, preactivated with EGF, is measured by its ability to transfer terminal phosphate from [gamma-32P]ATP to poly(GAT) substrate.
In DepthDetails ArticlePubMed