BDBM4410 4-Anilidoquinazoline deriv. 26a::4-[(6-methylquinazolin-4-yl)amino]benzoic acid
SMILES Cc1ccc2ncnc(Nc3ccc(cc3)C(O)=O)c2c1
InChI Key InChIKey=JQLHKPXFVRGGFZ-UHFFFAOYSA-N
Data  1 IC50
  Tab Delimited (TSV)   2D SDfile   Computed 3D by Vconf -m prep SDfile
Find this compound or compounds like it in BindingDB:
Activity Spreadsheet -- Enzyme Inhibition Constant Data from BindingDB
Found 1 hit for monomerid = 4410
TargetEpidermal growth factor receptor(Homo sapiens (Human))
Hebrew University Of Jerusalem
LigandPNGBDBM4410(4-Anilidoquinazoline deriv. 26a | 4-[(6-methylquin...)
Affinity DataIC50: >5.00E+4nM. Assay description: The activity of EGFR, preactivated with EGF, is measured by its ability to transfer terminal phosphate from [gamma-32P]ATP to poly(GAT) substrate.
In DepthDetails ArticlePubMed