BDBM44244 3-[(4-methoxyphenyl)sulfonyl-(phenylmethyl)amino]propanoic acid::3-[benzyl-(4-methoxyphenyl)sulfonyl-amino]propionic acid::3-[benzyl-(4-methoxyphenyl)sulfonylamino]propanoic acid::MLS001002621::SMR000369254::cid_2443717
SMILES COc1ccc(cc1)S(=O)(=O)N(CCC(O)=O)Cc1ccccc1
InChI Key InChIKey=XZKWYLIEUAWUJZ-UHFFFAOYSA-N
Data  1 EC50
  Tab Delimited (TSV)   2D SDfile   Computed 3D by Vconf -m prep SDfile
Find this compound or compounds like it in BindingDB:
Activity Spreadsheet -- Enzyme Inhibition Constant Data from BindingDB
Found 1 hit for monomerid = 44244
TargetSolute carrier family 12 member 5(Homo sapiens (Human))
Vanderbilt Screening Center For Gpcrs, Ion Channels And Transporters
Curated by PubChem BioAssay
LigandPNGBDBM44244(3-[(4-methoxyphenyl)sulfonyl-(phenylmethyl)amino]p...)
Affinity DataEC50:  6.36E+3nM. Assay description: Vanderbilt Screening Center for GPCRs, Ion Channels and Transporters Assay Provider: Eric Delpire Assay Provider Affliation: Vanderbilt University Gr...
In DepthDetails PCBioAssay