BDBM44472 1-Butyl-3-phenyl-1H-pyrazolo[3,4-b]quinoxaline::1-butyl-3-phenyl-pyrazolo[4,3-b]quinoxaline::1-butyl-3-phenylpyrazolo[4,3-b]quinoxaline::MLS000557569::SMR000148485::cid_2036162
SMILES CCCCn1nc(-c2ccccc2)c2nc3ccccc3nc12
InChI Key InChIKey=GEWQIEWYEGXENC-UHFFFAOYSA-N
Data  3 IC50  1 EC50
  Tab Delimited (TSV)   2D SDfile   Computed 3D by Vconf -m prep SDfile
Find this compound or compounds like it in BindingDB:
Activity Spreadsheet -- Enzyme Inhibition Constant Data from BindingDB
Found 4 hits for monomerid = 44472
TargetEphrin type-A receptor 4(Mus musculus)
Sanford-Burnham Center For Chemical Genomics
Curated by PubChem BioAssay
LigandPNGBDBM44472(1-Butyl-3-phenyl-1H-pyrazolo[3,4-b]quinoxaline | 1...)
Affinity DataIC50:  1.31E+4nM. Assay description: Data Source: Sanford-Burnham Center for Chemical Genomics (SBCCG) Source Affiliation: Sanford-Burnham Medical Research Institute (SBMRI, San Diego, C...
In DepthDetails PCBioAssay
TargetProtein LANA1(Human herpesvirus 8)
Broad Institute
Curated by PubChem BioAssay
LigandPNGBDBM44472(1-Butyl-3-phenyl-1H-pyrazolo[3,4-b]quinoxaline | 1...)
Affinity DataEC50:  8.88E+3nM. Assay description: Primary Collaborators: Kenneth Kaye,Brigham & Womens,Boston MA,kkaye@rics.bwh.harvard.edu,617-525-4256 Chantal Beauchemin,Brigham & Womens,Boston MA,...
In DepthDetails PCBioAssay
TargetGlycoprotein 42(Human herpesvirus 4 type 2)
Emory University
Curated by PubChem BioAssay
LigandPNGBDBM44472(1-Butyl-3-phenyl-1H-pyrazolo[3,4-b]quinoxaline | 1...)
Affinity DataIC50:  2.10E+3nM. Assay description: NIH Molecular Libraries Screening Centers Network [MLSCN] Emory Chemical Biology Discovery Center in MLSCN Assay provider: Theodore Jardetzky; Northw...
In DepthDetails PCBioAssay
TargetEphrin type-A receptor 4(Mus musculus)
Sanford-Burnham Center For Chemical Genomics
Curated by PubChem BioAssay
LigandPNGBDBM44472(1-Butyl-3-phenyl-1H-pyrazolo[3,4-b]quinoxaline | 1...)
Affinity DataIC50: >5.00E+4nM. Assay description: Sanford-Burnham Center for Chemical Genomics (SBCCG) Sanford-Burnham Medical Research Institute (SBMRI, San Diego, CA) NIH Molecular Libraries Screen...
In DepthDetails PCBioAssay