BDBM44535 4-Dimethylaminomethyl-5-hydroxy-1,2-dimethyl-1H-indole-3-carboxylic acid ethyl ester::4-[(dimethylamino)methyl]-5-hydroxy-1,2-dimethyl-3-indolecarboxylic acid ethyl ester;oxalic acid::4-[(dimethylamino)methyl]-5-hydroxy-1,2-dimethyl-indole-3-carboxylic acid ethyl ester;oxalic acid::MLS000076508::SMR000012717::cid_649608::ethanedioic acid;ethyl 4-[(dimethylamino)methyl]-1,2-dimethyl-5-oxidanyl-indole-3-carboxylate::ethyl 4-[(dimethylamino)methyl]-5-hydroxy-1,2-dimethylindole-3-carboxylate;oxalic acid
SMILES CCOC(=O)c1c(C)n(C)c2ccc(O)c(CN(C)C)c12
InChI Key InChIKey=CXCWEVZTMHDHDI-UHFFFAOYSA-N
Data  1 IC50
  Tab Delimited (TSV)   2D SDfile   Computed 3D by Vconf -m prep SDfile
Find this compound or compounds like it in BindingDB:
Activity Spreadsheet -- Enzyme Inhibition Constant Data from BindingDB
Found 1 hit for monomerid = 44535
TargetProtein Rev [8-24](Human immunodeficiency virus 1)
The Scripps Research Institute Molecular Screening Center
Curated by PubChem BioAssay
LigandPNGBDBM44535(4-Dimethylaminomethyl-5-hydroxy-1,2-dimethyl-1H-in...)
Affinity DataIC50: >7.94E+4nM. Assay description: Source (MLSCN Center Name): The Scripps Research Institute Molecular Screening Center Center Affiliation: The Scripps Research Institute, TSRI Assay ...
In DepthDetails PCBioAssay