BDBM445704 LX1606::US10683309, Example LX1606
SMILES CCOC(=O)[C@@H](N)Cc1ccc(cc1)-c1cc(O[C@H](c2ccc(Cl)cc2-n2ccc(C)n2)C(F)(F)F)nc(N)n1
InChI Key InChIKey=MDSQOJYHHZBZKA-GBXCKJPGSA-N
Data  2 IC50
  Tab Delimited (TSV)   2D SDfile   Computed 3D by Vconf -m prep SDfile
Find this compound or compounds like it in BindingDB:
Activity Spreadsheet -- Enzyme Inhibition Constant Data from BindingDB
Found 2 hits for monomerid = 445704
TargetTryptophan 5-hydroxylase 2(Homo sapiens (Human))
Max-DelbrÜCk-Centrum FÜR Molekulare Medizin
US Patent
LigandPNGBDBM445704(LX1606 | US10683309, Example LX1606)
Affinity DataIC50:  730nM. Assay description: The full-length coding sequences of human TPH1 and TPH2 were PCR amplified, ligated into a MBP fusion vector (pMalc2x, New England Biolabs, MA, USA) ...
In DepthDetails US Patent
TargetTryptophan 5-hydroxylase 1(Homo sapiens (Human))
Max-DelbrÜCk-Centrum FÜR Molekulare Medizin
US Patent
LigandPNGBDBM445704(LX1606 | US10683309, Example LX1606)
Affinity DataIC50:  770nM. Assay description: The full-length coding sequences of human TPH1 and TPH2 were PCR amplified, ligated into a MBP fusion vector (pMalc2x, New England Biolabs, MA, USA) ...
In DepthDetails US Patent