BDBM44666 1-(3-methoxyanilino)-4-isoquinolinecarboxylic acid::1-(3-methoxyanilino)isoquinoline-4-carboxylic acid::1-(m-anisidino)isoquinoline-4-carboxylic acid::1-[(3-methoxyphenyl)amino]isoquinoline-4-carboxylic acid::MLS000090445::SMR000025055::cid_3245146
SMILES COc1cccc(Nc2ncc(C(O)=O)c3ccccc23)c1
InChI Key InChIKey=JISALRNAGIYGKP-UHFFFAOYSA-N
Data  1 EC50
  Tab Delimited (TSV)   2D SDfile   Computed 3D by Vconf -m prep SDfile
Find this compound or compounds like it in BindingDB:
Activity Spreadsheet -- Enzyme Inhibition Constant Data from BindingDB
Found 1 hit for monomerid = 44666
TargetMultidrug resistance-associated protein 1(Homo sapiens (Human))
Srmlsc
Curated by PubChem BioAssay
LigandPNGBDBM44666(1-(3-methoxyanilino)-4-isoquinolinecarboxylic acid...)
Affinity DataEC50:  3.01E+3nM. Assay description: Southern Research Molecular Libraries Screening Center (SRMLSC) Southern Research Institute (Birmingham, Alabama) NIH Molecular Libraries Screening C...
In DepthDetails PCBioAssay