BDBM44940 2-(brosylamino)-N-(3-keto-1,5-dimethyl-2-phenyl-3-pyrazolin-4-yl)benzamide::2-[(4-bromophenyl)sulfonylamino]-N-(1,5-dimethyl-3-oxidanylidene-2-phenyl-pyrazol-4-yl)benzamide::2-[(4-bromophenyl)sulfonylamino]-N-(1,5-dimethyl-3-oxo-2-phenyl-4-pyrazolyl)benzamide::2-[(4-bromophenyl)sulfonylamino]-N-(1,5-dimethyl-3-oxo-2-phenylpyrazol-4-yl)benzamide::MLS000536119::SMR000155404::cid_2344399
SMILES Cc1c(NC(=O)c2ccccc2NS(=O)(=O)c2ccc(Br)cc2)c(=O)n(-c2ccccc2)n1C
InChI Key InChIKey=AJAPYXOUCVHDDV-UHFFFAOYSA-N
Data  1 EC50
  Tab Delimited (TSV)   2D SDfile   Computed 3D by Vconf -m prep SDfile
Find this compound or compounds like it in BindingDB:
Activity Spreadsheet -- Enzyme Inhibition Constant Data from BindingDB
Found 1 hit for monomerid = 44940
TargetMultidrug resistance-associated protein 1(Homo sapiens (Human))
Srmlsc
Curated by PubChem BioAssay
LigandPNGBDBM44940(2-(brosylamino)-N-(3-keto-1,5-dimethyl-2-phenyl-3-...)
Affinity DataEC50:  3.53E+3nM. Assay description: Southern Research Molecular Libraries Screening Center (SRMLSC) Southern Research Institute (Birmingham, Alabama) NIH Molecular Libraries Screening C...
In DepthDetails PCBioAssay