BDBM4499 4-[(2,4-Dichlorophenyl)amino]-6,7-dimethoxy-3-quinolinecarbaldehyde::4-[(2,4-dichlorophenyl)amino]-6,7-dimethoxyquinoline-3-carbaldehyde::6,7-Dimethoxyquinoline deriv. 17
SMILES COc1cc2ncc(C=O)c(Nc3ccc(Cl)cc3Cl)c2cc1OC
InChI Key InChIKey=SKRRXMAIMHHNCD-UHFFFAOYSA-N
Data  1 IC50
  Tab Delimited (TSV)   2D SDfile   Computed 3D by Vconf -m prep SDfile
Find this compound or compounds like it in BindingDB:
Activity Spreadsheet -- Enzyme Inhibition Constant Data from BindingDB
Found 1 hit for monomerid = 4499
TargetProto-oncogene tyrosine-protein kinase Src(Homo sapiens (Human))
Wyeth-Ayerst Research
LigandPNGBDBM4499(4-[(2,4-Dichlorophenyl)amino]-6,7-dimethoxy-3-quin...)
Affinity DataIC50:  250nMpH: 7.5 T: 2°C. Assay description: Src kinase activity was measured in an ELISA format. IC50 is the inhibitor concentration which inhibits 50% of kinase activity that catalyzes the tra...
In DepthDetails ArticlePubMed