BDBM45144 3-Amino-2-(4-methoxy-benzoyl)-4-(4-methoxycarbonyl-phenyl)-6-methyl-4,7-dihydro-thieno[2,3-b]pyridine-5-carboxylic acid ethyl ester::3-amino-4-(4-carbomethoxyphenyl)-6-methyl-2-p-anisoyl-4,7-dihydrothieno[2,3-b]pyridine-5-carboxylic acid ethyl ester;ethanol::3-amino-4-(4-methoxycarbonylphenyl)-2-[(4-methoxyphenyl)-oxomethyl]-6-methyl-4,7-dihydrothieno[2,3-b]pyridine-5-carboxylic acid ethyl ester;ethanol::MLS000590790::SMR000219156::cid_12005684::ethanol;ethyl 3-amino-2-(4-methoxybenzoyl)-4-(4-methoxycarbonylphenyl)-6-methyl-4,7-dihydrothieno[2,3-b]pyridine-5-carboxylate::ethanol;ethyl 3-azanyl-4-(4-methoxycarbonylphenyl)-2-(4-methoxyphenyl)carbonyl-6-methyl-4,7-dihydrothieno[2,3-b]pyridine-5-carboxylate
SMILES CCOC(=O)C1C(c2c(N)c(sc2N=C1C)C(=O)c1ccc(OC)cc1)c1ccc(cc1)C(=O)OC
InChI Key InChIKey=UCKYDVRVPRFLCP-UHFFFAOYSA-N
Data  1 EC50
  Tab Delimited (TSV)   2D SDfile   Computed 3D by Vconf -m prep SDfile
Find this compound or compounds like it in BindingDB:
Activity Spreadsheet -- Enzyme Inhibition Constant Data from BindingDB
Found 1 hit for monomerid = 45144
TargetMultidrug resistance-associated protein 1(Homo sapiens (Human))
Srmlsc
Curated by PubChem BioAssay
LigandPNGBDBM45144(3-Amino-2-(4-methoxy-benzoyl)-4-(4-methoxycarbonyl...)
Affinity DataEC50:  1.10E+3nM. Assay description: Southern Research Molecular Libraries Screening Center (SRMLSC) Southern Research Institute (Birmingham, Alabama) NIH Molecular Libraries Screening C...
In DepthDetails PCBioAssay