BDBM4525 4-Phenylamino-3-quinolinecarbonitrile deriv. 1c::4-[(2,4-Dichloro-5-methoxyphenyl)amino]-6,7-dimethoxy-3-quinolinecarbonitrile::4-[(2,4-dichloro-5-methoxyphenyl)amino]-6,7-dimethoxyquinoline-3-carbonitrile::CHEMBL100651
SMILES COc1cc(Nc2c(cnc3cc(OC)c(OC)cc23)C#N)c(Cl)cc1Cl
InChI Key InChIKey=VPAAYYSCJUHANG-UHFFFAOYSA-N
Data  2 IC50
  Tab Delimited (TSV)   2D SDfile   Computed 3D by Vconf -m prep SDfile
Find this compound or compounds like it in BindingDB:
Activity Spreadsheet -- Enzyme Inhibition Constant Data from BindingDB
Found 2 hits for monomerid = 4525
TargetProto-oncogene tyrosine-protein kinase Src(Homo sapiens (Human))
Wyeth Research
Curated by ChEMBL
LigandPNGBDBM4525(4-Phenylamino-3-quinolinecarbonitrile deriv. 1c | ...)
Affinity DataIC50:  30nM. Assay description: Inhibition of Src protein tryrosine kinase
In DepthDetails ArticlePubMed
TargetProto-oncogene tyrosine-protein kinase Src(Homo sapiens (Human))
Wyeth Research
Curated by ChEMBL
LigandPNGBDBM4525(4-Phenylamino-3-quinolinecarbonitrile deriv. 1c | ...)
Affinity DataIC50:  4.30nMpH: 7.5 T: 2°C. Assay description: Src kinase activity was measured in an ELISA format. IC50 is the inhibitor concentration which inhibits 50% of kinase activity that catalyzes the tra...
In DepthDetails ArticlePubMed