BDBM452526 2-amino-3-((3-((3R,5R)- 5-(4- chlorophenyl)tetrahydro- furan-3-yl)-1,2,4- oxadiazol-5-yl)methyl)- 5-methylpyrazolo[5,1- f][1,2,4]triazin-4(3H)- one::US10710994, Example 4
SMILES Cc1cnn2nc(N)n(Cc3nc(no3)[C@@H]3CO[C@H](C3)c3ccc(Cl)cc3)c(=O)c12
InChI Key InChIKey=PQLZHXGPCNTDOI-GXTWGEPZSA-N
Data  2 IC50
  Tab Delimited (TSV)   2D SDfile   Computed 3D by Vconf -m prep SDfile
Find this compound or compounds like it in BindingDB:
Activity Spreadsheet -- Enzyme Inhibition Constant Data from BindingDB
Found 2 hits for monomerid = 452526
TargetTransient receptor potential cation channel subfamily A member 1(Homo sapiens (Human))
Genentech
US Patent
LigandPNGBDBM452526(2-amino-3-((3-((3R,5R)- 5-(4- chlorophenyl)tetrahy...)
Affinity DataIC50:  0.660nM. Assay description: The IC50 (effective concentration) of compounds on the human TRPA1 channel was determined using a FLIPR Tetra instrument. CHO cells expressing TRPA1 ...
Ligand InfoPC cidPC sid
In DepthDetails US Patent
TargetTransient receptor potential cation channel subfamily A member 1(Homo sapiens (Human))
Genentech
US Patent
LigandPNGBDBM452526(2-amino-3-((3-((3R,5R)- 5-(4- chlorophenyl)tetrahy...)
Affinity DataIC50:  4.01nM. Assay description: The IC50 (effective concentration) of compounds on the human TRPA1 channel was determined using a FLIPR Tetra instrument. CHO cells expressing TRPA1 ...
Ligand InfoPC cidPC sid
In DepthDetails US Patent