BDBM45437 2-[[1-(4-chloro-2,5-dimethyl-phenyl)sulfonylprolyl]amino]propionic acid methyl ester::2-[[[1-(4-chloro-2,5-dimethylphenyl)sulfonyl-2-pyrrolidinyl]-oxomethyl]amino]propanoic acid methyl ester::MLS000113797::SMR000109689::cid_2930409::methyl 2-[[1-(4-chloranyl-2,5-dimethyl-phenyl)sulfonylpyrrolidin-2-yl]carbonylamino]propanoate::methyl 2-[[1-(4-chloro-2,5-dimethylphenyl)sulfonylpyrrolidine-2-carbonyl]amino]propanoate
SMILES COC(=O)C(C)NC(=O)C1CCCN1S(=O)(=O)c1cc(C)c(Cl)cc1C
InChI Key InChIKey=RARDHEXCDGEDBD-UHFFFAOYSA-N
Data  2 IC50
  Tab Delimited (TSV)   2D SDfile   Computed 3D by Vconf -m prep SDfile
Find this compound or compounds like it in BindingDB:
Activity Spreadsheet -- Enzyme Inhibition Constant Data from BindingDB
Found 2 hits for monomerid = 45437
TargetKallikrein-5(Homo sapiens (Human))
Pcmd
Curated by PubChem BioAssay
LigandPNGBDBM45437(2-[[1-(4-chloro-2,5-dimethyl-phenyl)sulfonylprolyl...)
Affinity DataIC50:  5.00E+4nM. Assay description: Molecular Library Screening Center Network (MLSCN) Penn Center for Molecular Discovery (PCMD) Assay Provider: Scott L. Diamond, University of Pennsy...
In DepthDetails PCBioAssay
TargetCoagulation factor XII(Homo sapiens (Human))
Pcmd
Curated by PubChem BioAssay
LigandPNGBDBM45437(2-[[1-(4-chloro-2,5-dimethyl-phenyl)sulfonylprolyl...)
Affinity DataIC50: >5.00E+4nM. Assay description: Molecular Library Screening Center Network (MLSCN) Penn Center for Molecular Discovery (PCMD) Assay Provider: Scott L. Diamond, University of Pennsy...
In DepthDetails PCBioAssay