BDBM45480 (3-methylpiperidino)-(1-piazthiol-4-ylsulfonyl-3-piperidyl)methanone::MLS000521824::SMR000132232::[1-(2,1,3-benzothiadiazol-4-ylsulfonyl)-3-piperidinyl]-(3-methyl-1-piperidinyl)methanone::[1-(2,1,3-benzothiadiazol-4-ylsulfonyl)piperidin-3-yl]-(3-methylpiperidin-1-yl)methanone::cid_9551219
SMILES CC1CCCN(C1)C(=O)C1CCCN(C1)S(=O)(=O)c1cccc2nsnc12
InChI Key InChIKey=KLURMKGZDDMAEC-UHFFFAOYSA-N
Data  1 IC50
  Tab Delimited (TSV)   2D SDfile   Computed 3D by Vconf -m prep SDfile
Find this compound or compounds like it in BindingDB:
Activity Spreadsheet -- Enzyme Inhibition Constant Data from BindingDB
Found 1 hit for monomerid = 45480
TargetCoagulation factor XII(Homo sapiens (Human))
Pcmd
Curated by PubChem BioAssay
LigandPNGBDBM45480((3-methylpiperidino)-(1-piazthiol-4-ylsulfonyl-3-p...)
Affinity DataIC50: >5.00E+4nM. Assay description: Molecular Library Screening Center Network (MLSCN) Penn Center for Molecular Discovery (PCMD) Assay Provider: Scott L. Diamond, University of Pennsy...
In DepthDetails PCBioAssay