BDBM4564 4-Phenylamino-3-quinolinecarbonitrile deriv. 31m::4-[(2,4-Dichloro-5-methoxyphenyl)amino]-6-methoxy-7-{3-[(2-(4-morpholinyl)ethyl)amino]propoxy}-6-methoxy-3-quinolinecarbonitrile::4-[(2,4-dichloro-5-methoxyphenyl)amino]-6-methoxy-7-(3-{[2-(morpholin-4-yl)ethyl]amino}propoxy)quinoline-3-carbonitrile
SMILES COc1cc(Nc2c(cnc3cc(OCCCNCCN4CCOCC4)c(OC)cc23)C#N)c(Cl)cc1Cl
InChI Key InChIKey=OGPRLOXNJCGODW-UHFFFAOYSA-N
Data  1 IC50
  Tab Delimited (TSV)   2D SDfile   Computed 3D by Vconf -m prep SDfile
Find this compound or compounds like it in BindingDB:
Activity Spreadsheet -- Enzyme Inhibition Constant Data from BindingDB
Found 1 hit for monomerid = 4564
TargetProto-oncogene tyrosine-protein kinase Src(Homo sapiens (Human))
Wyeth-Ayerst Research
LigandPNGBDBM4564(4-Phenylamino-3-quinolinecarbonitrile deriv. 31m |...)
Affinity DataIC50:  3nM. Assay description: Src kinase activity was measured in an ELISA format. IC50 is the inhibitor concentration which inhibits 50% of kinase activity that catalyzes the tra...
In DepthDetails ArticlePubMed