BDBM4565 4-Phenylamino-3-quinolinecarbonitrile deriv. 31n::4-[(2,4-Dichloro-5-methoxyphenyl)amino]-7-{3-[((2-(dimethylamino)ethyl)methyl)amino]propoxy}-6-methoxy-3-quinolinecarbonitrile::4-[(2,4-dichloro-5-methoxyphenyl)amino]-7-(3-{[2-(dimethylamino)ethyl](methyl)amino}propoxy)-6-methoxyquinoline-3-carbonitrile
SMILES COc1cc(Nc2c(cnc3cc(OCCCN(C)CCN(C)C)c(OC)cc23)C#N)c(Cl)cc1Cl
InChI Key InChIKey=GPCRIJCMKHJUFK-UHFFFAOYSA-N
Data  1 IC50
  Tab Delimited (TSV)   2D SDfile   Computed 3D by Vconf -m prep SDfile
Find this compound or compounds like it in BindingDB:
Activity Spreadsheet -- Enzyme Inhibition Constant Data from BindingDB
Found 1 hit for monomerid = 4565
TargetProto-oncogene tyrosine-protein kinase Src(Homo sapiens (Human))
Wyeth-Ayerst Research
LigandPNGBDBM4565(4-Phenylamino-3-quinolinecarbonitrile deriv. 31n |...)
Affinity DataIC50:  2.30nM. Assay description: Src kinase activity was measured in an ELISA format. IC50 is the inhibitor concentration which inhibits 50% of kinase activity that catalyzes the tra...
In DepthDetails ArticlePubMed