BDBM45664 3-acetamido-3-phenyl-propionic acid [2-(4-amino-2,6-diketo-1,3-dimethyl-pyrimidin-5-yl)-2-keto-ethyl] ester::3-acetamido-3-phenylpropanoic acid [2-(4-amino-1,3-dimethyl-2,6-dioxo-5-pyrimidinyl)-2-oxoethyl] ester::MLS000516535::SMR000342650::[2-(4-amino-1,3-dimethyl-2,6-dioxopyrimidin-5-yl)-2-oxoethyl] 3-acetamido-3-phenylpropanoate::[2-[4-azanyl-1,3-dimethyl-2,6-bis(oxidanylidene)pyrimidin-5-yl]-2-oxidanylidene-ethyl] 3-acetamido-3-phenyl-propanoate::cid_4244537
SMILES CC(=O)NC(CC(=O)OCC(=O)c1c(N)n(C)c(=O)n(C)c1=O)c1ccccc1
InChI Key InChIKey=ZHHYPVVUUUFYHG-UHFFFAOYSA-N
Data  1 IC50
  Tab Delimited (TSV)   2D SDfile   Computed 3D by Vconf -m prep SDfile
Find this compound or compounds like it in BindingDB:
Activity Spreadsheet -- Enzyme Inhibition Constant Data from BindingDB
Found 1 hit for monomerid = 45664
TargetCoagulation factor XII(Homo sapiens (Human))
Pcmd
Curated by PubChem BioAssay
LigandPNGBDBM45664(3-acetamido-3-phenyl-propionic acid [2-(4-amino-2,...)
Affinity DataIC50: >5.00E+4nM. Assay description: Molecular Library Screening Center Network (MLSCN) Penn Center for Molecular Discovery (PCMD) Assay Provider: Scott L. Diamond, University of Pennsy...
In DepthDetails PCBioAssay