BDBM46077 (4E)-4-[3-(2-chlorophenyl)-5H-[1,2,4]triazolo[3,4-b][1,3,4]thiadiazin-6-ylidene]-2-hydroxy-1-cyclohexa-2,5-dienone::(4E)-4-[3-(2-chlorophenyl)-5H-[1,2,4]triazolo[3,4-b][1,3,4]thiadiazin-6-ylidene]-2-hydroxy-cyclohexa-2,5-dien-1-one::(4E)-4-[3-(2-chlorophenyl)-5H-[1,2,4]triazolo[3,4-b][1,3,4]thiadiazin-6-ylidene]-2-hydroxycyclohexa-2,5-dien-1-one::(4E)-4-[3-(2-chlorophenyl)-5H-[1,2,4]triazolo[3,4-b][1,3,4]thiadiazin-6-ylidene]-2-oxidanyl-cyclohexa-2,5-dien-1-one::MLS-0390861.0001::cid_16000021
SMILES Oc1ccc(cc1O)C1=Nn2c(SC1)nnc2-c1ccccc1Cl
InChI Key InChIKey=RULJSWPQJWGXFS-UHFFFAOYSA-N
Data  2 IC50
  Tab Delimited (TSV)   2D SDfile   Computed 3D by Vconf -m prep SDfile
Find this compound or compounds like it in BindingDB:
Activity Spreadsheet -- Enzyme Inhibition Constant Data from BindingDB
Found 2 hits for monomerid = 46077
TargetAlkaline phosphatase, germ cell type(Homo sapiens (Human))
Burnham Center For Chemical Genomics
Curated by PubChem BioAssay
LigandPNGBDBM46077((4E)-4-[3-(2-chlorophenyl)-5H-[1,2,4]triazolo[3,4-...)
Affinity DataIC50:  1.50E+4nM. Assay description: Data Source: Sanford-Burnham Center for Chemical Genomics (SBCCG) Source Affiliation: Sanford-Burnham Medical Research Institute (SBMRI, San Diego, C...
In DepthDetails PCBioAssay
TargetAlkaline phosphatase, tissue-nonspecific isozyme(Homo sapiens (Human))
Burnham Center For Chemical Genomics
Curated by PubChem BioAssay
LigandPNGBDBM46077((4E)-4-[3-(2-chlorophenyl)-5H-[1,2,4]triazolo[3,4-...)
Affinity DataIC50:  4.02E+3nM. Assay description: Sanford-Burnham Center for Chemical Genomics (SBCCG) Sanford-Burnham Medical Research Institute (SBMRI, San Diego, CA) NIH Molecular Libraries Screen...
In DepthDetails PCBioAssay