BDBM462119 US10766884, Example A36::US11220494, Example A36
SMILES CC(O)c1nc2c(F)cc(cc2n1C(C)C(F)F)-c1nc(N[C@@H]2CCOC[C@H]2O)ncc1Cl
InChI Key InChIKey=GEZUTMXESRSXNV-VOMPFKTISA-N
Data  4 KI
  Tab Delimited (TSV)   2D SDfile   Computed 3D by Vconf -m prep SDfile
Find this compound or compounds like it in BindingDB:
Activity Spreadsheet -- Enzyme Inhibition Constant Data from BindingDB
Found 4 hits for monomerid = 462119
TargetCyclin-dependent kinase 4/G1/S-specific cyclin-D1(Homo sapiens (Human))
Pfizer
US Patent
LigandPNGBDBM462119(US10766884, Example A36 | US11220494, Example A36)
Affinity DataKi:  0.200nM. Assay description: CDK4/Cyclin D1: The purpose CDK4/Cyclin D1 assay is to evaluate the inhibition (% inhibition, Kiapp and Ki values) in the presence of small molecule ...
Ligand InfoPC cidPC sid
In DepthDetails US Patent
TargetCyclin-dependent kinase 4/G1/S-specific cyclin-D1(Homo sapiens (Human))
Pfizer
US Patent
LigandPNGBDBM462119(US10766884, Example A36 | US11220494, Example A36)
Affinity DataKi:  0.200nM. Assay description: The purpose CDK4/Cyclin D1 assay is to evaluate the inhibition (% inhibition, Kiapp and Ki values) in the presence of small molecule inhibitors by us...
Ligand InfoPC cidPC sid
In DepthDetails US Patent
TargetCyclin-dependent kinase 6/G1/S-specific cyclin-D3(Homo sapiens (Human))
Pfizer
US Patent
LigandPNGBDBM462119(US10766884, Example A36 | US11220494, Example A36)
Affinity DataKi:  3.70nM. Assay description: The purpose of the CDK6/Cyclin D3 assay is to evaluate the inhibition (% inhibition, Kiapp and Ki values) in the presence of small molecule inhibitor...
Ligand InfoPC cidPC sid
In DepthDetails US Patent
TargetCyclin-dependent kinase 6/G1/S-specific cyclin-D3(Homo sapiens (Human))
Pfizer
US Patent
LigandPNGBDBM462119(US10766884, Example A36 | US11220494, Example A36)
Affinity DataKi:  3.70nM. Assay description: CDK6/Cyclin D3: The purpose of the CDK6/Cyclin D3 assay is to evaluate the inhibition (% inhibition, Kiapp and Ki values) in the presence of small mo...
Ligand InfoPC cidPC sid
In DepthDetails US Patent