BDBM462215 US10766884, Example F33::US11220494, Example F33
SMILES CNC(=O)CN1CC[C@@H](Nc2cc(c(Cl)cn2)-c2ccc3ncn(c3n2)C(C)(C)C)[C@H](O)C1
InChI Key InChIKey=GSPKCQHHHDAZPV-IEBWSBKVSA-N
Data  4 KI
  Tab Delimited (TSV)   2D SDfile   Computed 3D by Vconf -m prep SDfile
Find this compound or compounds like it in BindingDB:
Activity Spreadsheet -- Enzyme Inhibition Constant Data from BindingDB
Found 4 hits for monomerid = 462215
TargetCyclin-dependent kinase 4/G1/S-specific cyclin-D1(Homo sapiens (Human))
Pfizer
US Patent
LigandPNGBDBM462215(US10766884, Example F33 | US11220494, Example F33)
Affinity DataKi:  0.200nM. Assay description: CDK4/Cyclin D1: The purpose CDK4/Cyclin D1 assay is to evaluate the inhibition (% inhibition, Kiapp and Ki values) in the presence of small molecule ...
Ligand InfoPC cidPC sid
In DepthDetails US Patent
TargetCyclin-dependent kinase 4/G1/S-specific cyclin-D1(Homo sapiens (Human))
Pfizer
US Patent
LigandPNGBDBM462215(US10766884, Example F33 | US11220494, Example F33)
Affinity DataKi:  0.200nM. Assay description: The purpose CDK4/Cyclin D1 assay is to evaluate the inhibition (% inhibition, Kiapp and Ki values) in the presence of small molecule inhibitors by us...
Ligand InfoPC cidPC sid
In DepthDetails US Patent
TargetCyclin-dependent kinase 6/G1/S-specific cyclin-D3(Homo sapiens (Human))
Pfizer
US Patent
LigandPNGBDBM462215(US10766884, Example F33 | US11220494, Example F33)
Affinity DataKi:  5.20nM. Assay description: The purpose of the CDK6/Cyclin D3 assay is to evaluate the inhibition (% inhibition, Kiapp and Ki values) in the presence of small molecule inhibitor...
Ligand InfoPC cidPC sid
In DepthDetails US Patent
TargetCyclin-dependent kinase 6/G1/S-specific cyclin-D3(Homo sapiens (Human))
Pfizer
US Patent
LigandPNGBDBM462215(US10766884, Example F33 | US11220494, Example F33)
Affinity DataKi:  5.20nM. Assay description: CDK6/Cyclin D3: The purpose of the CDK6/Cyclin D3 assay is to evaluate the inhibition (% inhibition, Kiapp and Ki values) in the presence of small mo...
Ligand InfoPC cidPC sid
In DepthDetails US Patent