BDBM462360 US10766902, Example 74
SMILES COC[C@@H]1CN(CCO1)c1ccc(Nc2ncc3c(n2)n(-c2cncc(N=S(C)(C)=O)n2)n(CC=C)c3=O)cc1
InChI Key InChIKey=RTRGLLODUAPNIR-FQEVSTJZSA-N
Data  1 IC50
  Tab Delimited (TSV)   2D SDfile   Computed 3D by Vconf -m prep SDfile
Find this compound or compounds like it in BindingDB:
Activity Spreadsheet -- Enzyme Inhibition Constant Data from BindingDB
Found 1 hit for monomerid = 462360
TargetWee1-like protein kinase(Homo sapiens (Human))
Almac Discovery
US Patent
LigandPNGBDBM462360(US10766902, Example 74)
Affinity DataIC50:  0.300nM. Assay description: All reactions took place in 60 μL volumes in reaction buffer containing 40 mM Tris-HCl and 20 mM magnesium chloride, supplemented with 0.1 mg/mL...
Ligand InfoPC cidPC sid
In DepthDetails US Patent