BDBM46299 MLS000030575::SMR000001198::cid_650929
SMILES O=c1c2c(-c3ccccc3CC22CCCC2)n2nnnc2n1Cc1ccccc1
InChI Key InChIKey=STEPKYNRQJONAV-UHFFFAOYSA-N
Data  3 EC50
  Tab Delimited (TSV)   2D SDfile   Computed 3D by Vconf -m prep SDfile
Find this compound or compounds like it in BindingDB:
Activity Spreadsheet -- Enzyme Inhibition Constant Data from BindingDB
Found 3 hits for monomerid = 46299
TargetBcl-2-like protein 10 [11-204](Homo sapiens (Human))
Nmmlsc
Curated by PubChem BioAssay
LigandPNGBDBM46299(MLS000030575 | SMR000001198 | cid_650929)
Affinity DataEC50:  5.52E+3nM. Assay description: University of New Mexico Assay Overview: Assay Support: NIH 1X01 MH079850-01 HTS to identify small molecule regulators of Bcl-2 family protein int...
In DepthDetails PCBioAssay
TargetBcl-2-like protein 10 [11-204](Homo sapiens (Human))
Nmmlsc
Curated by PubChem BioAssay
LigandPNGBDBM46299(MLS000030575 | SMR000001198 | cid_650929)
Affinity DataEC50:  3.57E+3nM. Assay description: University of New Mexico Assay Overview: Assay Support: NIH 1X01 MH079850-01 HTS to identify small molecule regulators of Bcl-2 family protein int...
In DepthDetails PCBioAssay
TargetStreptokinase A(Streptococcus pyogenes M1 GAS)
Broad Institute
Curated by PubChem BioAssay
LigandPNGBDBM46299(MLS000030575 | SMR000001198 | cid_650929)
Affinity DataEC50:  6.74E+3nM. Assay description: Keywords: Group A streptococcus, GAS, streptokinase, expression, virulence, inhibition, dose response, EC50 Assay Overview: The goal of this assa...
In DepthDetails PCBioAssay