BDBM46403 6-amino-1-isobutyl-3-methyl-5-[2-(phenylthio)acetyl]pyrimidine-2,4-quinone::6-amino-3-methyl-1-(2-methylpropyl)-5-(2-phenylsulfanylacetyl)pyrimidine-2,4-dione::6-amino-3-methyl-1-(2-methylpropyl)-5-[1-oxo-2-(phenylthio)ethyl]pyrimidine-2,4-dione::6-azanyl-3-methyl-1-(2-methylpropyl)-5-(2-phenylsulfanylethanoyl)pyrimidine-2,4-dione::MLS000335735::SMR000253489::cid_2116311
SMILES CC(C)Cn1c(N)c(C(=O)CSc2ccccc2)c(=O)n(C)c1=O
InChI Key InChIKey=LJFMBSRWXNSEBO-UHFFFAOYSA-N
Data  2 IC50
  Tab Delimited (TSV)   2D SDfile   Computed 3D by Vconf -m prep SDfile
Find this compound or compounds like it in BindingDB:
Activity Spreadsheet -- Enzyme Inhibition Constant Data from BindingDB
Found 2 hits for monomerid = 46403
TargetSignal transducer and activator of transcription 1-alpha/beta(Homo sapiens (Human))
The Scripps Research Institute Molecular Screening Center
Curated by PubChem BioAssay
LigandPNGBDBM46403(6-amino-1-isobutyl-3-methyl-5-[2-(phenylthio)acety...)
Affinity DataIC50: >5.57E+4nM. Assay description: Source (MLPCN Center Name): The Scripps Research Institute Molecular Screening Center Center Affiliation: The Scripps Research Institute (TSRI) Assay...
In DepthDetails PCBioAssay
TargetSignal transducer and activator of transcription 3 [702-738,740-752](Homo sapiens (Human))
The Scripps Research Institute Molecular Screening Center
Curated by PubChem BioAssay
LigandPNGBDBM46403(6-amino-1-isobutyl-3-methyl-5-[2-(phenylthio)acety...)
Affinity DataIC50:  5.57E+3nM. Assay description: Source (MLPCN Center Name): The Scripps Research Institute Molecular Screening Center Center Affiliation: The Scripps Research Institute (TSRI) Assay...
In DepthDetails PCBioAssay