BDBM46409 3-ethyl-4-[[5-methyl-2-(4-phenylphenyl)-1,3-oxazol-4-yl]methyl]piperazin-2-one::3-ethyl-4-[[5-methyl-2-(4-phenylphenyl)-4-oxazolyl]methyl]-2-piperazinone::3-ethyl-4-[[5-methyl-2-(4-phenylphenyl)oxazol-4-yl]methyl]piperazin-2-one::4-[(2-biphenyl-4-yl-5-methyl-1,3-oxazol-4-yl)methyl]-3-ethylpiperazin-2-one::MLS000732847::SMR000316479::cid_16190638
SMILES CCC1N(Cc2nc(oc2C)-c2ccc(cc2)-c2ccccc2)CCNC1=O
InChI Key InChIKey=FUSSCZQVVQIIPW-UHFFFAOYSA-N
Data  3 IC50
  Tab Delimited (TSV)   2D SDfile   Computed 3D by Vconf -m prep SDfile
Find this compound or compounds like it in BindingDB:
Activity Spreadsheet -- Enzyme Inhibition Constant Data from BindingDB
Found 3 hits for monomerid = 46409
TargetSignal transducer and activator of transcription 3 [702-738,740-752](Homo sapiens (Human))
The Scripps Research Institute Molecular Screening Center
Curated by PubChem BioAssay
LigandPNGBDBM46409(3-ethyl-4-[[5-methyl-2-(4-phenylphenyl)-1,3-oxazol...)
Affinity DataIC50:  7.34E+3nM. Assay description: Source (MLPCN Center Name): The Scripps Research Institute Molecular Screening Center Center Affiliation: The Scripps Research Institute (TSRI) Assay...
Ligand InfoPC cidPC sid
In DepthDetails PCBioAssay
TargetGalanin receptor type 3(Homo sapiens (Human))
The Scripps Research Institute Molecular Screening Center
Curated by PubChem BioAssay
LigandPNGBDBM46409(3-ethyl-4-[[5-methyl-2-(4-phenylphenyl)-1,3-oxazol...)
Affinity DataIC50:  2.76E+3nM
Ligand InfoPC cidPC sid
In DepthDetails PCBioAssay
TargetSignal transducer and activator of transcription 1-alpha/beta(Homo sapiens (Human))
The Scripps Research Institute Molecular Screening Center
Curated by PubChem BioAssay
LigandPNGBDBM46409(3-ethyl-4-[[5-methyl-2-(4-phenylphenyl)-1,3-oxazol...)
Affinity DataIC50: >5.57E+4nM. Assay description: Source (MLPCN Center Name): The Scripps Research Institute Molecular Screening Center Center Affiliation: The Scripps Research Institute (TSRI) Assay...
Ligand InfoPC cidPC sid
In DepthDetails PCBioAssay