BDBM46457 (Z)-4,4-Dimethyl-1-(3-nitro-phenyl)-2-[1,2,4]triazol-1-yl-pent-1-en-3-one::(Z)-4,4-dimethyl-1-(3-nitrophenyl)-2-(1,2,4-triazol-1-yl)-1-penten-3-one::(Z)-4,4-dimethyl-1-(3-nitrophenyl)-2-(1,2,4-triazol-1-yl)pent-1-en-3-one::MLS000554833::SMR000146950::cid_5715188
SMILES CC(C)(C)C(=O)C(=C\c1cccc(c1)[N+]([O-])=O)\n1cncn1
InChI Key InChIKey=VKSOIYNNOFGGES-JYRVWZFOSA-N
Data  5 IC50  2 EC50
  Tab Delimited (TSV)   2D SDfile   Computed 3D by Vconf -m prep SDfile
Find this compound or compounds like it in BindingDB:
Activity Spreadsheet -- Enzyme Inhibition Constant Data from BindingDB
Found 7 hits for monomerid = 46457
TargetEukaryotic translation initiation factor 2-alpha kinase 3(Homo sapiens (Human))
The Scripps Research Institute Molecular Screening Center
Curated by PubChem BioAssay
LigandPNGBDBM46457((Z)-4,4-Dimethyl-1-(3-nitro-phenyl)-2-[1,2,4]triaz...)
Affinity DataEC50: >5.57E+4nM. Assay description: Source (MLPCN Center Name): The Scripps Research Institute Molecular Screening Center (SRIMSC) Center Affiliation: The Scripps Research Institute (TS...
In DepthDetails PCBioAssay
TargetEukaryotic translation initiation factor 2-alpha kinase 3(Homo sapiens (Human))
The Scripps Research Institute Molecular Screening Center
Curated by PubChem BioAssay
LigandPNGBDBM46457((Z)-4,4-Dimethyl-1-(3-nitro-phenyl)-2-[1,2,4]triaz...)
Affinity DataEC50: >5.57E+4nM. Assay description: Source (MLPCN Center Name): The Scripps Research Institute Molecular Screening Center (SRIMSC) Center Affiliation: The Scripps Research Institute (TS...
In DepthDetails PCBioAssay
TargetDNA damage-inducible transcript 3 protein(Mus musculus)
Emory University
Curated by PubChem BioAssay
LigandPNGBDBM46457((Z)-4,4-Dimethyl-1-(3-nitro-phenyl)-2-[1,2,4]triaz...)
Affinity DataIC50:  6.74E+3nM. Assay description: NIH Molecular Libraries Screening Centers Network [MLSCN] Emory Chemical Biology Discovery Center in MLSCN Assay provider: Dr. Randal Kaufman, Univer...
In DepthDetails PCBioAssay
TargetReceptor-interacting serine/threonine-protein kinase 2(Homo sapiens (Human))
The Scripps Research Institute Molecular Screening Center
Curated by PubChem BioAssay
LigandPNGBDBM46457((Z)-4,4-Dimethyl-1-(3-nitro-phenyl)-2-[1,2,4]triaz...)
Affinity DataIC50:  897nM
In DepthDetails PCBioAssay
TargetDNA damage-inducible transcript 3 protein(Mus musculus)
Emory University
Curated by PubChem BioAssay
LigandPNGBDBM46457((Z)-4,4-Dimethyl-1-(3-nitro-phenyl)-2-[1,2,4]triaz...)
Affinity DataIC50:  6.74E+3nM. Assay description: NIH Molecular Libraries Screening Centers Network [MLSCN] Emory Chemical Biology Discovery Center in MLSCN Assay provider: Dr. Randal Kaufman, Univer...
In DepthDetails PCBioAssay
TargetBeta-lactamase(Pseudomonas aeruginosa)
The Scripps Research Institute Molecular Screening Center
Curated by PubChem BioAssay
LigandPNGBDBM46457((Z)-4,4-Dimethyl-1-(3-nitro-phenyl)-2-[1,2,4]triaz...)
Affinity DataIC50: >4.98E+4nM
In DepthDetails PCBioAssay
TargetX-box-binding protein 1(Homo sapiens (Human))
Emory University
Curated by PubChem BioAssay
LigandPNGBDBM46457((Z)-4,4-Dimethyl-1-(3-nitro-phenyl)-2-[1,2,4]triaz...)
Affinity DataIC50:  1.57E+3nM. Assay description: NIH Molecular Libraries Screening Centers Network [MLSCN] Emory Chemical Biology Discovery Center in MLSCN Assay provider: Dr. Randal Kaufman, Univer...
In DepthDetails PCBioAssay