BDBM46496 (2Z)-2-(nitrosomethylene)-1H-quinolin-8-ol::(2Z)-2-(nitrosomethylidene)-1H-quinolin-8-ol::8-hydroxyquinoline-2-carbaldehyde oxime::MLS000686710::SMR000339810::cid_5403232
SMILES Oc1cccc2ccc(CN=O)nc12
InChI Key InChIKey=NKRKBHZORQYYNV-UHFFFAOYSA-N
Data  2 EC50
  Tab Delimited (TSV)   2D SDfile   Computed 3D by Vconf -m prep SDfile
Find this compound or compounds like it in BindingDB:
Activity Spreadsheet -- Enzyme Inhibition Constant Data from BindingDB
Found 2 hits for monomerid = 46496
TargetEukaryotic translation initiation factor 2-alpha kinase 3(Homo sapiens (Human))
The Scripps Research Institute Molecular Screening Center
Curated by PubChem BioAssay
LigandPNGBDBM46496((2Z)-2-(nitrosomethylene)-1H-quinolin-8-ol | (2Z)-...)
Affinity DataEC50: >5.57E+4nM. Assay description: Source (MLPCN Center Name): The Scripps Research Institute Molecular Screening Center (SRIMSC) Center Affiliation: The Scripps Research Institute (TS...
In DepthDetails PCBioAssay
TargetEukaryotic translation initiation factor 2-alpha kinase 3(Homo sapiens (Human))
The Scripps Research Institute Molecular Screening Center
Curated by PubChem BioAssay
LigandPNGBDBM46496((2Z)-2-(nitrosomethylene)-1H-quinolin-8-ol | (2Z)-...)
Affinity DataEC50: >5.57E+4nM. Assay description: Source (MLPCN Center Name): The Scripps Research Institute Molecular Screening Center (SRIMSC) Center Affiliation: The Scripps Research Institute (TS...
In DepthDetails PCBioAssay