BDBM4651 N-(4-bromo-2-fluorophenyl)-6-methoxy-7-[2-(1H-1,2,3-triazol-1-yl)ethoxy]quinazolin-4-amine::ZD4190
SMILES COc1cc2c(Nc3ccc(Br)cc3F)ncnc2cc1OCCn1ccnn1
InChI Key InChIKey=YBTGTVGEKMZEQX-UHFFFAOYSA-N
Data  7 IC50
  Tab Delimited (TSV)   2D SDfile   Computed 3D by Vconf -m prep SDfile
Find this compound or compounds like it in BindingDB:
Activity Spreadsheet -- Enzyme Inhibition Constant Data from BindingDB
Found 7 hits for monomerid = 4651
TargetVascular endothelial growth factor receptor 1(Homo sapiens (Human))
Astrazeneca
LigandPNGBDBM4651(N-(4-bromo-2-fluorophenyl)-6-methoxy-7-[2-(1H-1,2,...)
Affinity DataIC50:  700nMT: 2°C. Assay description: An ELISA assay was used to determine the ability of inhibitor to inhibit VEGF-R RTK activity. The compounds were incubated with enzyme 20 min at room...
In DepthDetails ArticlePubMed
TargetVascular endothelial growth factor receptor 2(Homo sapiens (Human))
Astrazeneca
LigandPNGBDBM4651(N-(4-bromo-2-fluorophenyl)-6-methoxy-7-[2-(1H-1,2,...)
Affinity DataIC50:  30nMT: 2°C. Assay description: An ELISA assay was used to determine the ability of inhibitor to inhibit VEGF-R RTK activity. The compounds were incubated with enzyme 20 min at room...
In DepthDetails ArticlePubMed
TargetFibroblast growth factor receptor 1(Homo sapiens (Human))
Astrazeneca
LigandPNGBDBM4651(N-(4-bromo-2-fluorophenyl)-6-methoxy-7-[2-(1H-1,2,...)
Affinity DataIC50: >1.00E+5nMT: 2°C. Assay description: An ELISA assay was used to determine the ability of inhibitor to inhibit FGFR-1 TK activity. The compounds were incubated with enzyme 20 min at room ...
In DepthDetails ArticlePubMed
TargetEpidermal growth factor receptor(Homo sapiens (Human))
Astrazeneca
LigandPNGBDBM4651(N-(4-bromo-2-fluorophenyl)-6-methoxy-7-[2-(1H-1,2,...)
Affinity DataIC50:  400nMT: 2°C. Assay description: An ELISA assay was used to determine the ability of inhibitor to inhibit EGF-R RTK activity. The compounds were incubated with enzyme 20 min at room ...
In DepthDetails ArticlePubMed
TargetVascular endothelial growth factor receptor 2(Homo sapiens (Human))
Astrazeneca
LigandPNGBDBM4651(N-(4-bromo-2-fluorophenyl)-6-methoxy-7-[2-(1H-1,2,...)
Affinity DataIC50:  30nMT: 2°C. Assay description: An ELISA assay was used to determine the ability of inhibitor to inhibit VEGF-R RTK activity. The compounds were incubated with enzyme 20 min at room...
In DepthDetails ArticlePubMed
TargetFibroblast growth factor receptor 1(Homo sapiens (Human))
Astrazeneca
LigandPNGBDBM4651(N-(4-bromo-2-fluorophenyl)-6-methoxy-7-[2-(1H-1,2,...)
Affinity DataIC50: >1.00E+5nMT: 2°C. Assay description: An ELISA assay was used to determine the ability of inhibitor to inhibit FGFR-1 TK activity. The compounds were incubated with enzyme 20 min at room ...
In DepthDetails ArticlePubMed
TargetVascular endothelial growth factor receptor 1(Homo sapiens (Human))
Astrazeneca
LigandPNGBDBM4651(N-(4-bromo-2-fluorophenyl)-6-methoxy-7-[2-(1H-1,2,...)
Affinity DataIC50:  700nMpH: 7.4 T: 2°C. Assay description: An ELISA assay was used to determine the ability of inhibitor to inhibit VEGF-R RTK activity. The compounds were incubated with enzyme 20 min at room...
In DepthDetails ArticlePubMed