BDBM467048 US10800784, Example 38
SMILES C[C@H]1CN(Cc2cnc(n12)[C@@](C)(O)C(F)(F)F)C(=O)c1cccc(n1)-c1ccc(F)cc1
InChI Key InChIKey=PFSNXMGGSZJNCV-YEJXKQKISA-N
Data  2 IC50
  Tab Delimited (TSV)   2D SDfile   Computed 3D by Vconf -m prep SDfile
Find this compound or compounds like it in BindingDB:
Activity Spreadsheet -- Enzyme Inhibition Constant Data from BindingDB
Found 2 hits for monomerid = 467048
LigandPNGBDBM467048(US10800784, Example 38)
Affinity DataIC50:  4nM. Assay description: In the case of human PDHK2 (hPDHK2, NCBI Reference Database Accession number NM_002611.4), modified hPDHK2 cDNA wherein FLAG-Tag sequence was added t...
Ligand InfoPC cidPC sid
In DepthDetails US Patent
LigandPNGBDBM467048(US10800784, Example 38)
Affinity DataIC50: <3nM. Assay description: In the case of human PDHK1 (hPDHK1, NCBI Reference Database Accession number NM_002610.3), a 1.3 kbp fragment encoding this protein was isolated from...
Ligand InfoPC cidPC sid
In DepthDetails US Patent