BDBM4676 4-Anilinoquinazoline 23::N-(2-fluoro-4-methylphenyl)-6-methoxy-7-(piperidin-4-ylmethoxy)quinazolin-4-amine
SMILES COc1cc2c(Nc3ccc(C)cc3F)ncnc2cc1OCC1CCNCC1
InChI Key InChIKey=QAWSAMDJZZDGDW-UHFFFAOYSA-N
Data  4 IC50
  Tab Delimited (TSV)   2D SDfile   Computed 3D by Vconf -m prep SDfile
Find this compound or compounds like it in BindingDB:
Activity Spreadsheet -- Enzyme Inhibition Constant Data from BindingDB
Found 4 hits for monomerid = 4676
TargetVascular endothelial growth factor receptor 1(Homo sapiens (Human))
Astrazeneca
LigandPNGBDBM4676(4-Anilinoquinazoline 23 | N-(2-fluoro-4-methylphen...)
Affinity DataIC50:  700nMT: 2°C. Assay description: An ELISA assay was used to determine the ability of inhibitor to inhibit VEGF-R RTK activity. The compounds were incubated with enzyme 20 min at room...
In DepthDetails ArticlePubMed
TargetEpidermal growth factor receptor(Homo sapiens (Human))
Astrazeneca
LigandPNGBDBM4676(4-Anilinoquinazoline 23 | N-(2-fluoro-4-methylphen...)
Affinity DataIC50:  500nMT: 2°C. Assay description: An ELISA assay was used to determine the ability of inhibitor to inhibit EGF-R RTK activity. The compounds were incubated with enzyme 20 min at room ...
In DepthDetails ArticlePubMed
TargetFibroblast growth factor receptor 1(Homo sapiens (Human))
Astrazeneca
LigandPNGBDBM4676(4-Anilinoquinazoline 23 | N-(2-fluoro-4-methylphen...)
Affinity DataIC50:  1.23E+4nMT: 2°C. Assay description: An ELISA assay was used to determine the ability of inhibitor to inhibit FGFR-1 TK activity. The compounds were incubated with enzyme 20 min at room ...
In DepthDetails ArticlePubMed
TargetVascular endothelial growth factor receptor 2(Homo sapiens (Human))
Astrazeneca
LigandPNGBDBM4676(4-Anilinoquinazoline 23 | N-(2-fluoro-4-methylphen...)
Affinity DataIC50:  30nMT: 2°C. Assay description: An ELISA assay was used to determine the ability of inhibitor to inhibit VEGF-R RTK activity. The compounds were incubated with enzyme 20 min at room...
In DepthDetails ArticlePubMed