BDBM46771 (adamantane-1-carbonylamino)thiourea::1-(1-adamantylcarbonylamino)thiourea::2-(1-adamantylcarbonyl)hydrazine-1-carbothioamide::MLS000584134::SMR000203297::[[1-adamantyl(oxo)methyl]amino]thiourea::cid_2726512
SMILES [H]C12CC3([H])CC([H])(C1)CC(C2)(C3)C(=O)NNC(N)=S
InChI Key InChIKey=JVJZNULYJHOVPX-UHFFFAOYSA-N
Data  3 EC50
  Tab Delimited (TSV)   2D SDfile   Computed 3D by Vconf -m prep SDfile
Find this compound or compounds like it in BindingDB:
Activity Spreadsheet -- Enzyme Inhibition Constant Data from BindingDB
Found 3 hits for monomerid = 46771
TargetIon channel NompC(Danio rerio)
The Scripps Research Institute Molecular Screening Center
Curated by PubChem BioAssay
LigandPNGBDBM46771((adamantane-1-carbonylamino)thiourea | 1-(1-adaman...)
Affinity DataEC50:  1.47E+3nM. Assay description: Source (MLPCN Center Name): The Scripps Research Institute Molecular Screening Center (SRIMSC) Center Affiliation: The Scripps Research Institute (TS...
In DepthDetails PCBioAssay
TargetCorticotropin-releasing factor-binding protein(Homo sapiens (Human))
Burnham Center For Chemical Genomics
Curated by PubChem BioAssay
LigandPNGBDBM46771((adamantane-1-carbonylamino)thiourea | 1-(1-adaman...)
Affinity DataEC50:  3.53E+3nM. Assay description: Data Source: Sanford-Burnham Center for Chemical Genomics (SBCCG) Source Affiliation: Sanford-Burnham Medical Research Institute (SBMRI, San Diego, C...
In DepthDetails PCBioAssay
TargetMucolipin-3(Homo sapiens (Human))
The Scripps Research Institute Molecular Screening Center
Curated by PubChem BioAssay
LigandPNGBDBM46771((adamantane-1-carbonylamino)thiourea | 1-(1-adaman...)
Affinity DataEC50:  2.76E+3nM. Assay description: Source (MLPCN Center Name): The Scripps Research Institute Molecular Screening Center (SRIMSC) Center Affiliation: The Scripps Research Institute (TS...
In DepthDetails PCBioAssay