BDBM471617 US10822334, Compound ONT380::US20230382923, Compound Tucatinib
SMILES Cc1cc(Nc2ncnc3ccc(NC4=NC(C)(C)CO4)cc23)ccc1Oc1ccn2ncnc2c1
InChI Key InChIKey=SDEAXTCZPQIFQM-UHFFFAOYSA-N
Data  10 IC50
  Tab Delimited (TSV)   2D SDfile   Computed 3D by Vconf -m prep SDfile
Find this compound or compounds like it in BindingDB:
Activity Spreadsheet -- Enzyme Inhibition Constant Data from BindingDB
Found 10 hits for monomerid = 471617
TargetReceptor tyrosine-protein kinase erbB-2(Homo sapiens (Human))
TBA
US Patent
LigandPNGBDBM471617(US10822334, Compound ONT380 | US20230382923, Compo...)
Affinity DataIC50:  2nM. Assay description: HER2: The compounds' inhibition of target modulation were determined as follows: BT474 cells were sorted in 96 well plates (20000 cells/well) wit...
In DepthDetails US Patent
TargetEpidermal growth factor receptor(Homo sapiens (Human))
TBA
US Patent
LigandPNGBDBM471617(US10822334, Compound ONT380 | US20230382923, Compo...)
Affinity DataIC50: >3.00E+3nM. Assay description: EGFR: The compounds' inhibition of target modulation were determined as follows: NCI-H838 cells were sorted in 96 well plates (20000 cells/well) ...
In DepthDetails US Patent
TargetReceptor tyrosine-protein kinase erbB-2(Homo sapiens (Human))
TBA
US Patent
LigandPNGBDBM471617(US10822334, Compound ONT380 | US20230382923, Compo...)
Affinity DataIC50:  12nM. Assay description: Enzyme-linked immunosorbent assays (ELISA) were performed to measure phosphorylated ERBB2 levels. A capture antibody able to detect phosphorylated an...
In DepthDetails US Patent
TargetReceptor tyrosine-protein kinase erbB-2(Homo sapiens (Human))
TBA
US Patent
LigandPNGBDBM471617(US10822334, Compound ONT380 | US20230382923, Compo...)
Affinity DataIC50:  3nM. Assay description: 1) 1× kinase reaction buffer was prepared from 1 volume of 5× kinase reaction buffer and 4 volumes of water, 1 mM dithiothreitol, 5 mM magnesium chlo...
In DepthDetails US Patent
TargetReceptor tyrosine-protein kinase erbB-2(Homo sapiens (Human))
TBA
US Patent
LigandPNGBDBM471617(US10822334, Compound ONT380 | US20230382923, Compo...)
Affinity DataIC50:  14nM. Assay description: Inhibition of HER2 (unknown origin)
In DepthDetails PubMed
TargetEpidermal growth factor receptor(Homo sapiens (Human))
TBA
US Patent
LigandPNGBDBM471617(US10822334, Compound ONT380 | US20230382923, Compo...)
Affinity DataIC50:  449nM. Assay description: Inhibition of N-terminal GST fused EGFR (668 to 1091 residues) (unknown origin) using poly (Glu-Tyr) E4Y1 peptide as substrate incubated for 2 hrs by...
In DepthDetails PubMed
TargetReceptor tyrosine-protein kinase erbB-2(Homo sapiens (Human))
TBA
US Patent
LigandPNGBDBM471617(US10822334, Compound ONT380 | US20230382923, Compo...)
Affinity DataIC50:  12nM. Assay description: Table B3: Enzyme-linked immunosorbent assays (ELISA) were performed to measure phosphorylated ERBB2 levels. A capture antibody able to detect phospho...
In DepthDetails US Patent
TargetReceptor tyrosine-protein kinase erbB-2(Homo sapiens (Human))
TBA
US Patent
LigandPNGBDBM471617(US10822334, Compound ONT380 | US20230382923, Compo...)
Affinity DataIC50:  6.90nM. Assay description: Inhibition of HER2 (unknown origin)
In DepthDetails PubMed
TargetEpidermal growth factor receptor(Homo sapiens (Human))
TBA
US Patent
LigandPNGBDBM471617(US10822334, Compound ONT380 | US20230382923, Compo...)
Affinity DataIC50:  449nM. Assay description: Inhibition of EGFR (unknown origin)
In DepthDetails PubMed
TargetReceptor tyrosine-protein kinase erbB-2(Homo sapiens (Human))
TBA
US Patent
LigandPNGBDBM471617(US10822334, Compound ONT380 | US20230382923, Compo...)
Affinity DataIC50:  6.90nM. Assay description: Inhibition of N-terminal GST fused HER2 (679 to 1255 residues) (unknown origin) using poly (Glu-Tyr) E4Y1 peptide as substrate measured after 4 hrs b...
In DepthDetails PubMed